Reaction Details
TargetCathepsin K
LigandBDBM50223936
Substrate/Competitorn/a
Meas. Tech.ChEMBL_458256 (CHEMBL924502)
IC50 4±n/a nM
Citation Teno, NMiyake, TEhara, TIrie, OSakaki, JOhmori, OGunji, HMatsuura, NMasuya, KHitomi, YNonomura, KHoriuchi, MGohda, KIwasaki, AUmemura, ITada, SKometani, MIwasaki, GCowan-Jacob, SWMissbach, MLattmann, RBetschart, C Novel scaffold for cathepsin K inhibitors. Bioorg Med Chem Lett17:6096-100 (2007) 
 
Cathepsin K
Name:Cathepsin K
Type:Enzyme
Mol. Mass.:36975.68
Organism:Homo sapiens (Human)
Description:P43235
Residue:329
BDBM50223936
NameBDBM50223936
Synonyms:6-((5,5-dimethyl-2,4-dioxooxazolidin-3-yl)methyl)-7-neopentyl-7H-pyrrolo[2,3-d]pyrimidine-2-carbonitrile | CHEMBL249759
TypeSmall organic molecule
Emp. Form.C18H21N5O3
Mol. Mass.355.391
SMILESCC(C)(C)Cn1c(CN2C(=O)OC(C)(C)C2=O)cc2cnc(nc12)C#N