Reaction Details
TargetHistamine H3 receptor
LigandBDBM50224189
Substrate/Competitorn/a
Meas. Tech.ChEMBL_450587 (CHEMBL900871)
Ki 0.72±n/a nM
Citation Altenbach, RJLiu, HBanfor, PNBrowman, KEFox, GBFryer, RMKomater, VAKrueger, KMMarsh, KMiller, TRPan, JBPan, LSun, MThiffault, CWetter, JZhao, CZhou, DEsbenshade, TAHancock, AACowart, MD Synthesis, potency, and in vivo profiles of quinoline containing histamine H3 receptor inverse agonists. J Med Chem50:5439-48 (2007) 
 
Histamine H3 receptor
Name:Histamine H3 receptor
Type:G Protein-Coupled Receptor (GPCR)
Mol. Mass.:48607.98
Organism:Rattus norvegicus (rat)
Description:n/a
Residue:445
BDBM50224189
NameBDBM50224189
Synonyms:(R)-2-(4-methyl-2-(pyrrolidin-1-yl)pyrimidin-5-yl)-6-(2-(2-methylpyrrolidin-1-yl)ethyl)quinoline CHEMBL237191
TypeSmall organic molecule
Emp. Form.C25H31N5
Mol. Mass.401.5471
SMILESC[C@@H]1CCCN1CCc1ccc2nc(ccc2c1)-c1cnc(nc1C)N1CCCC1