Reaction Details
Target11-beta-hydroxysteroid dehydrogenase 1
LigandBDBM50224208
Substrate/Competitorn/a
Meas. Tech.ChEMBL_450657 (CHEMBL900940)
IC50 10±n/a nM
Citation Yuan, CSt Jean, DJLiu, QCai, LLi, AHan, NMoniz, GAskew, BHungate, RWJohansson, LTedenborg, LPyring, DWilliams, MHale, CChen, MCupples, RZhang, JJordan, SBartberger, MDSun, YEmery, MWang, MFotsch, C The discovery of 2-anilinothiazolones as 11beta-HSD1 inhibitors. Bioorg Med Chem Lett17:6056-61 (2007) 
 
11-beta-hydroxysteroid dehydrogenase 1
Name:11-beta-hydroxysteroid dehydrogenase 1
Type:Enzyme
Mol. Mass.:32409.16
Organism:Homo sapiens (Human)
Description:P28845
Residue:292
BDBM50224208
NameBDBM50224208
Synonyms:2-(2-chlorophenylamino)-5-isopropylthiazol-4(5H)-one | CHEMBL235762
TypeSmall organic molecule
Emp. Form.C12H13ClN2OS
Mol. Mass.268.762
SMILESCC(C)c1sc(Nc2ccccc2Cl)nc1O