Reaction Details
Target11-beta-hydroxysteroid dehydrogenase 1
LigandBDBM50224209
Substrate/Competitorn/a
Meas. Tech.ChEMBL_450656 (CHEMBL900939)
Ki 1000±n/a nM
Citation Yuan, CSt Jean, DJLiu, QCai, LLi, AHan, NMoniz, GAskew, BHungate, RWJohansson, LTedenborg, LPyring, DWilliams, MHale, CChen, MCupples, RZhang, JJordan, SBartberger, MDSun, YEmery, MWang, MFotsch, C The discovery of 2-anilinothiazolones as 11beta-HSD1 inhibitors. Bioorg Med Chem Lett17:6056-61 (2007) 
 
11-beta-hydroxysteroid dehydrogenase 1
Name:11-beta-hydroxysteroid dehydrogenase 1
Type:Enzyme
Mol. Mass.:32409.16
Organism:Homo sapiens (Human)
Description:P28845
Residue:292
BDBM50224209
NameBDBM50224209
Synonyms:5-isopropyl-2-(2-methoxyphenylamino)thiazol-4(5H)-one | CHEMBL238097
TypeSmall organic molecule
Emp. Form.C13H16N2O2S
Mol. Mass.264.343
SMILESCOc1ccccc1Nc1nc(O)c(s1)C(C)C