Reaction Details
Target11-beta-hydroxysteroid dehydrogenase 1
LigandBDBM50224216
Substrate/Competitorn/a
Meas. Tech.ChEMBL_450656 (CHEMBL900939)
Ki 6.3±n/a nM
Citation Yuan, CSt Jean, DJLiu, QCai, LLi, AHan, NMoniz, GAskew, BHungate, RWJohansson, LTedenborg, LPyring, DWilliams, MHale, CChen, MCupples, RZhang, JJordan, SBartberger, MDSun, YEmery, MWang, MFotsch, C The discovery of 2-anilinothiazolones as 11beta-HSD1 inhibitors. Bioorg Med Chem Lett17:6056-61 (2007) 
 
11-beta-hydroxysteroid dehydrogenase 1
Name:11-beta-hydroxysteroid dehydrogenase 1
Type:Enzyme
Mol. Mass.:32409.16
Organism:Homo sapiens (Human)
Description:P28845
Residue:292
BDBM50224216
NameBDBM50224216
Synonyms:2-(2-chlorophenylamino)-5-cyclopentylthiazol-4(5H)-one | CHEMBL240052
TypeSmall organic molecule
Emp. Form.C14H15ClN2OS
Mol. Mass.294.8
SMILESOc1nc(Nc2ccccc2Cl)sc1C1CCCC1