Reaction Details
TargetCollagenase 3
LigandBDBM50224853
Substrate/Competitorn/a
Meas. Tech.ChEMBL_458357 (CHEMBL941691)
IC50 0.49±n/a nM
Citation Freeman-Cook, KDReiter, LANoe, MCAntipas, ASDanley, DEDatta, KDowns, JTEisenbeis, SEskra, JDGarmene, DJGreer, EMGriffiths, RJGuzman, RHardink, JRJanat, FJones, CSMartinelli, GJMitchell, PGLaird, ERLiras, JLLopresti-Morrow, LLPandit, JReilly, UDRobertson, DVaughn-Bowser, MLWolf-Gouviea, LAYocum, SA Potent, selective spiropyrrolidine pyrimidinetrione inhibitors of MMP-13. Bioorg Med Chem Lett17:6529-34 (2007) 
 
Collagenase 3
Name:Collagenase 3
Type:Enzyme
Mol. Mass.:53808.06
Organism:Homo sapiens (Human)
Description:P45452
Residue:471
BDBM50224853
NameBDBM50224853
Synonyms:5-(4-(4-(1H-benzo[d]imidazol-2-yl)phenoxy)phenoxy)-5-(2-ethoxyethyl)pyrimidine-2,4,6(1H,3H,5H)-trione | CHEMBL248543
TypeSmall organic molecule
Emp. Form.C27H24N4O6
Mol. Mass.500.5027
SMILESCCOCCC1(Oc2ccc(Oc3ccc(cc3)-c3nc4ccccc4[nH]3)cc2)C(=O)NC(=O)NC1=O