Reaction Details
TargetCollagenase 3
LigandBDBM50224856
Substrate/Competitorn/a
Meas. Tech.ChEMBL_458357 (CHEMBL941691)
IC50 0.11±n/a nM
Citation Freeman-Cook, KDReiter, LANoe, MCAntipas, ASDanley, DEDatta, KDowns, JTEisenbeis, SEskra, JDGarmene, DJGreer, EMGriffiths, RJGuzman, RHardink, JRJanat, FJones, CSMartinelli, GJMitchell, PGLaird, ERLiras, JLLopresti-Morrow, LLPandit, JReilly, UDRobertson, DVaughn-Bowser, MLWolf-Gouviea, LAYocum, SA Potent, selective spiropyrrolidine pyrimidinetrione inhibitors of MMP-13. Bioorg Med Chem Lett17:6529-34 (2007) 
 
Collagenase 3
Name:Collagenase 3
Type:Enzyme
Mol. Mass.:53808.06
Organism:Homo sapiens (Human)
Description:P45452
Residue:471
BDBM50224856
NameBDBM50224856
Synonyms:1-{6-[4-(1H-benzoimidazol-2-yl)-phenoxy]-pyridin-3-yl}-1,7,9-triaza-spiro[4.5]decane-6,8,10-trione | CHEMBL398934
TypeSmall organic molecule
Emp. Form.C25H20N6O4
Mol. Mass.468.4641
SMILESO=C1NC(=O)C2(CCCN2c2ccc(Oc3ccc(cc3)-c3nc4ccccc4[nH]3)nc2)C(=O)N1