Reaction Details
TargetCarboxypeptidase B2
LigandBDBM50226603
Substrate/Competitorn/a
Meas. Tech.ChEMBL_452077 (CHEMBL901238)
Ki 300±n/a nM
Citation Bunnage, MEBlagg, JSteele, JOwen, DRAllerton, CMcElroy, ABMiller, DRinger, TButcher, KBeaumont, KEvans, KGray, AJHolland, SJFeeder, NMoore, RSBrown, DG Discovery of potent& selective inhibitors of activated thrombin-activatable fibrinolysis inhibitor for the treatment of thrombosis. J Med Chem50:6095-103 (2007) 
 
Carboxypeptidase B2
Name:Carboxypeptidase B2
Type:Enzyme
Mol. Mass.:48432.74
Organism:Homo sapiens (Human)
Description:Q96IY4
Residue:423
BDBM50226603
NameBDBM50226603
Synonyms:(+/-)-5-amino-2-(mercaptomethyl)pentanoic acid | CHEMBL237008
TypeSmall organic molecule
Emp. Form.C6H13NO2S
Mol. Mass.163.238
SMILESNCCCC(CS)C(O)=O