Reaction Details
TargetCarboxypeptidase N catalytic chain
LigandBDBM50201438
Substrate/Competitorn/a
Meas. Tech.ChEMBL_452078 (CHEMBL901239)
Ki 2±n/a nM
Citation Bunnage, MEBlagg, JSteele, JOwen, DRAllerton, CMcElroy, ABMiller, DRinger, TButcher, KBeaumont, KEvans, KGray, AJHolland, SJFeeder, NMoore, RSBrown, DG Discovery of potent& selective inhibitors of activated thrombin-activatable fibrinolysis inhibitor for the treatment of thrombosis. J Med Chem50:6095-103 (2007) 
 
Carboxypeptidase N catalytic chain
Name:Carboxypeptidase N catalytic chain
Type:PROTEIN
Mol. Mass.:52293.66
Organism:Homo sapiens (Human)
Description:ChEMBL_1496379
Residue:458
BDBM50201438
NameBDBM50201438
Synonyms:(+/-)-5-guanidino-2-(mercaptomethyl)pentanoic acid CHEMBL236822
TypeSmall organic molecule
Emp. Form.C7H15N3O2S
Mol. Mass.205.278
SMILES[#7]\[#6](-[#7])=[#7]\[#6]-[#6]-[#6]-[#6](-[#6]-[#16])-[#6](-[#8])=O