Reaction Details
TargetCarboxypeptidase B2
LigandBDBM50226600
Substrate/Competitorn/a
Meas. Tech.ChEMBL_452077 (CHEMBL901238)
Ki 344±n/a nM
Citation Bunnage, MEBlagg, JSteele, JOwen, DRAllerton, CMcElroy, ABMiller, DRinger, TButcher, KBeaumont, KEvans, KGray, AJHolland, SJFeeder, NMoore, RSBrown, DG Discovery of potent& selective inhibitors of activated thrombin-activatable fibrinolysis inhibitor for the treatment of thrombosis. J Med Chem50:6095-103 (2007) 
 
Carboxypeptidase B2
Name:Carboxypeptidase B2
Type:Enzyme
Mol. Mass.:48432.74
Organism:Homo sapiens (Human)
Description:Q96IY4
Residue:423
BDBM50226600
NameBDBM50226600
Synonyms:(2S)-2-[(2-aminoethyl)amino]-3-(1H-imidazol-4-yl)propanoic acid | CHEMBL235697
TypeSmall organic molecule
Emp. Form.C8H14N4O2
Mol. Mass.198.2224
SMILESNCCN[C@@H](Cc1cnc[nH]1)C(O)=O