Reaction Details
TargetNAD(P)H dehydrogenase [quinone] 1
LigandBDBM50226828
Substrate/Competitorn/a
Meas. Tech.ChEMBL_452277 (CHEMBL901432)
IC50 250±n/a nM
Citation Nolan, KAZhao, HFaulder, PFFrenkel, ADTimson, DJSiegel, DRoss, DBurke, TRStratford, IJBryce, RA Coumarin-based inhibitors of human NAD(P)H:quinone oxidoreductase-1. Identification, structure-activity, off-target effects and in vitro human pancreatic cancer toxicity. J Med Chem50:6316-25 (2007) 
 
NAD(P)H dehydrogenase [quinone] 1
Name:NAD(P)H dehydrogenase [quinone] 1
Type:Homodimer
Mol. Mass.:30874.82
Organism:Homo sapiens (Human)
Description:n/a
Residue:274
BDBM50226828
NameBDBM50226828
Synonyms:7-(4-hydroxy-2-oxo-2H-chromen-3-yl)-6a,7-dihydro-4aH-pyrano[3,2-c;5,6-c']dichromene-6,8-dione | CHEMBL391213
TypeSmall organic molecule
Emp. Form.C28H16O8
Mol. Mass.480.4218
SMILESOc1c(C2C3C(=O)OC4C=CC=CC4=C3Oc3c2c(=O)oc2ccccc32)c(=O)oc2ccccc12