Reaction Details
TargetNAD(P)H dehydrogenase [quinone] 1
LigandBDBM50055693
Substrate/Competitorn/a
Meas. Tech.ChEMBL_452277 (CHEMBL901432)
IC50 2300±n/a nM
Citation Nolan, KAZhao, HFaulder, PFFrenkel, ADTimson, DJSiegel, DRoss, DBurke, TRStratford, IJBryce, RA Coumarin-based inhibitors of human NAD(P)H:quinone oxidoreductase-1. Identification, structure-activity, off-target effects and in vitro human pancreatic cancer toxicity. J Med Chem50:6316-25 (2007) 
 
NAD(P)H dehydrogenase [quinone] 1
Name:NAD(P)H dehydrogenase [quinone] 1
Type:Homodimer
Mol. Mass.:30874.82
Organism:Homo sapiens (Human)
Description:n/a
Residue:274
BDBM50055693
NameBDBM50055693
Synonyms:4-hydroxy-3-[4-hydroxy-2-oxo-2H-3-chromenyl(4-hydroxyphenyl)methyl]-2H-2-chromenone CHEMBL391292
TypeSmall organic molecule
Emp. Form.C25H16O7
Mol. Mass.428.3903
SMILESOc1ccc(cc1)C(c1c(O)c2ccccc2oc1=O)c1c(O)c2ccccc2oc1=O