Reaction Details
TargetNAD(P)H dehydrogenase [quinone] 1
LigandBDBM50055711
Substrate/Competitorn/a
Meas. Tech.ChEMBL_452277 (CHEMBL901432)
IC50 250±n/a nM
Citation Nolan, KAZhao, HFaulder, PFFrenkel, ADTimson, DJSiegel, DRoss, DBurke, TRStratford, IJBryce, RA Coumarin-based inhibitors of human NAD(P)H:quinone oxidoreductase-1. Identification, structure-activity, off-target effects and in vitro human pancreatic cancer toxicity. J Med Chem50:6316-25 (2007) 
 
NAD(P)H dehydrogenase [quinone] 1
Name:NAD(P)H dehydrogenase [quinone] 1
Type:Homodimer
Mol. Mass.:30874.82
Organism:Homo sapiens (Human)
Description:n/a
Residue:274
BDBM50055711
NameBDBM50055711
Synonyms:3-[4-di(4,7-dihydroxy-2-oxo-2H-3-chromenyl)methylphenyl(4,7-dihydroxy-2-oxo-2H-3-chromenyl)methyl]-4,7-dihydroxy-2H-2-chromenone CHEMBL437179
TypeSmall organic molecule
Emp. Form.C44H26O16
Mol. Mass.810.6676
SMILESOc1ccc2c(O)c(C(c3ccc(cc3)C(c3c(O)c4ccc(O)cc4oc3=O)c3c(O)c4ccc(O)cc4oc3=O)c3c(O)c4ccc(O)cc4oc3=O)c(=O)oc2c1