Reaction Details
TargetNAD(P)H dehydrogenase [quinone] 1
LigandBDBM50055689
Substrate/Competitorn/a
Meas. Tech.ChEMBL_452277 (CHEMBL901432)
IC50 200±n/a nM
Citation Nolan, KAZhao, HFaulder, PFFrenkel, ADTimson, DJSiegel, DRoss, DBurke, TRStratford, IJBryce, RA Coumarin-based inhibitors of human NAD(P)H:quinone oxidoreductase-1. Identification, structure-activity, off-target effects and in vitro human pancreatic cancer toxicity. J Med Chem50:6316-25 (2007) 
 
NAD(P)H dehydrogenase [quinone] 1
Name:NAD(P)H dehydrogenase [quinone] 1
Type:Homodimer
Mol. Mass.:30874.82
Organism:Homo sapiens (Human)
Description:n/a
Residue:274
BDBM50055689
NameBDBM50055689
Synonyms:12-(4-hydroxy-2-oxochromen-3-yl)-12H-5,10- dioxatetraphen-11-one (Compound 13) CHEMBL32926
TypeSmall organic molecule
Emp. Form.C25H14O6
Mol. Mass.410.3751
SMILESOc1c(C2c3ccccc3Oc3c2c(=O)oc2ccccc32)c(=O)oc2ccccc12