Reaction Details
TargetCalpain-1 catalytic subunit
LigandBDBM50073850
Substrate/Competitorn/a
Meas. Tech.ChEMBL_461561 (CHEMBL928702)
IC50 70±n/a nM
Citation Nam, DHLee, KSKim, SHKim, SMJung, SYChung, SHKim, HJKim, NDJin, CLee, YS Design and synthesis of 4-quinolinone 2-carboxamides as calpain inhibitors. Bioorg Med Chem Lett18:205-9 (2008) 
 
Calpain-1 catalytic subunit
Name:Calpain-1 catalytic subunit
Type:Protein
Mol. Mass.:81880.51
Organism:Homo sapiens (Human)
Description:n/a
Residue:714
BDBM50073850
NameBDBM50073850
Synonyms:(S)-2-((S)-2-Benzyloxycarbonylamino-3-methyl-butyrylamino)-3-phenyl-propionic acid MDL-28170 [1-(1-Benzyl-2-oxo-ethylcarbamoyl)-2-methyl-propyl]-carbamic acid benzyl ester benzyl (2S)-3-methyl-1-oxo-1-(1-oxo-3-phenylpropan-2-ylamino)butan-2-ylcarbamate | benzyl (S)-3-methyl-1-oxo-1-(1-oxo-3-phenylpropan-2-ylamino)butan-2-ylcarbamate
TypeSmall organic molecule
Emp. Form.C22H26N2O4
Mol. Mass.382.4528
SMILESCC(C)[C@H](NC(=O)OCc1ccccc1)C(=O)NC(Cc1ccccc1)C=O