Reaction Details
TargetCoagulation factor X
LigandBDBM50228930
Substrate/Competitorn/a
Meas. Tech.ChEMBL_461718 (CHEMBL928849)
Ki 0.1±n/a nM
Citation Young, RJBorthwick, ADBrown, DBurns-Kurtis, CLCampbell, MChan, CCharbaut, MChung, CWConvery, MAKelly, HAPaul King, NKleanthous, SMason, AMPateman, AJPatikis, ANPinto, ILPollard, DRSenger, SShah, GPToomey, JRWatson, NSWeston, HE Structure and property based design of factor Xa inhibitors: pyrrolidin-2-ones with biaryl P4 motifs. Bioorg Med Chem Lett18:23-7 (2008) 
 
Coagulation factor X
Name:Coagulation factor X
Type:Enzyme
Mol. Mass.:54726.60
Organism:Homo sapiens (Human)
Description:n/a
Residue:488
BDBM50228930
NameBDBM50228930
Synonyms:(E)-2-(6-chloro-benzo[b]thiophen-2-yl)-ethenesulfonic acid [1-(3-fluoro-2'-methanesulfonyl-biphenyl-4-yl)-2-oxo-pyrrolidin-3-yl]-amide | CHEMBL439418
TypeSmall organic molecule
Emp. Form.C27H22ClFN2O5S3
Mol. Mass.605.12
SMILESCS(=O)(=O)c1ccccc1-c1ccc(N2CCC(NS(=O)(=O)\C=C\c3cc4ccc(Cl)cc4s3)C2=O)c(F)c1