Reaction Details
TargetMitogen-activated protein kinase 10
LigandBDBM50206421
Substrate/Competitorn/a
Meas. Tech.ChEMBL_462166 (CHEMBL944994)
IC50 540±n/a nM
Citation Peifer, CUrich, RSchattel, VAbadleh, MRöttig, MKohlbacher, OLaufer, S Implications for selectivity of 3,4-diarylquinolinones as p38alphaMAP kinase inhibitors. Bioorg Med Chem Lett18:1431-5 (2008) 
 
Mitogen-activated protein kinase 10
Name:Mitogen-activated protein kinase 10
Type:Enzyme
Mol. Mass.:52586.89
Organism:Homo sapiens (Human)
Description:n/a
Residue:464
BDBM50206421
NameBDBM50206421
Synonyms:3-(4-fluorophenyl)-5-isopropyl-4-(pyridin-4-yl)isoxazole 4-[3-(4-fluorophenyl)-5-isopropylisoxazol-4-yl]pyridine | CHEMBL220227
TypeSmall organic molecule
Emp. Form.C17H15FN2O
Mol. Mass.282.3122
SMILESCC(C)c1onc(c1-c1ccncc1)-c1ccc(F)cc1