Reaction Details
TargetMacrophage colony-stimulating factor 1 receptor
LigandBDBM50233707
Substrate/Competitorn/a
Meas. Tech.ChEMBL_462418 (CHEMBL927234)
IC50 1±n/a nM
Citation Illig, CRChen, JWall, MJWilson, KJBallentine, SKRudolph, MJDesJarlais, RLChen, YSchubert, CPetrounia, ICrysler, CSMolloy, CJChaikin, MAManthey, CLPlayer, MRTomczuk, BEMeegalla, SK Discovery of novel FMS kinase inhibitors as anti-inflammatory agents. Bioorg Med Chem Lett18:1642-8 (2008) 
 
Macrophage colony-stimulating factor 1 receptor
Name:Macrophage colony-stimulating factor 1 receptor
Type:Protein
Mol. Mass.:107979.48
Organism:Homo sapiens (Human)
Description:P07333
Residue:972
BDBM50233707
NameBDBM50233707
Synonyms:5-cyano-N-(4-(4-methylpiperazin-1-yl)-2-(4-methylpiperidin-1-yl)phenyl)furan-2-carboxamide | CHEMBL252436
TypeSmall organic molecule
Emp. Form.C23H29N5O2
Mol. Mass.407.5087
SMILESCC1CCN(CC1)c1cc(ccc1NC(=O)c1ccc(o1)C#N)N1CCN(C)CC1