Reaction Details
TargetBeta-secretase 1
LigandBDBM50157441
Substrate/Competitorn/a
Meas. Tech.ChEMBL_462611 (CHEMBL929600)
IC50 3.9±n/a nM
Citation Hamada, YOhta, HMiyamoto, NYamaguchi, RYamani, AHidaka, KKimura, TSaito, KHayashi, YIshiura, SKiso, Y Novel non-peptidic and small-sized BACE1 inhibitors. Bioorg Med Chem Lett18:1643-7 (2008) 
 
Beta-secretase 1
Name:Beta-secretase 1
Type:Protein
Mol. Mass.:55755.10
Organism:Homo sapiens (Human)
Description:P56817
Residue:501
BDBM50157441
NameBDBM50157441
Synonyms:5-((2R,3S)-3-((S)-2-((S)-2-((S)-2-amino-3-(2H-tetrazole-5-carboxamido)propanamido)-3-methylbutanamido)-4-methylpentanamido)-2-hydroxy-4-phenylbutanamido)isophthalic acid CHEMBL183546
TypeSmall organic molecule
Emp. Form.C34H44N10O10
Mol. Mass.752.7742
SMILESCC(C)C[C@H](NC(=O)[C@@H](NC(=O)[C@@H](N)CNC(=O)c1nnn[nH]1)C(C)C)C(=O)N[C@@H](Cc1ccccc1)[C@@H](O)C(=O)Nc1cc(cc(c1)C(O)=O)C(O)=O