Reaction Details
TargetBeta-secretase 1
LigandBDBM16034
Substrate/Competitorn/a
Meas. Tech.ChEMBL_462611 (CHEMBL929600)
IC50 15±n/a nM
Citation Hamada, YOhta, HMiyamoto, NYamaguchi, RYamani, AHidaka, KKimura, TSaito, KHayashi, YIshiura, SKiso, Y Novel non-peptidic and small-sized BACE1 inhibitors. Bioorg Med Chem Lett18:1643-7 (2008) 
 
Beta-secretase 1
Name:Beta-secretase 1
Type:Protein
Mol. Mass.:55755.10
Organism:Homo sapiens (Human)
Description:P56817
Residue:501
BDBM16034
NameBDBM16034
Synonyms:1-N-[(2S,3R)-4-(cyclopropylamino)-3-hydroxy-1-phenylbutan-2-yl]-5-(N-methylmethanesulfonamido)-3-N-[(1R)-1-phenylethyl]benzene-1,3-dicarboxamide CHEMBL378225 L-000384950 hydroxyethylamine (HEA) derived inhibitor 1
TypeSmall organic molecule
Emp. Form.C31H38N4O5S
Mol. Mass.578.722
SMILESC[C@@H](NC(=O)c1cc(cc(c1)C(=O)N[C@@H](Cc1ccccc1)[C@H](O)CNC1CC1)N(C)S(C)(=O)=O)c1ccccc1