Reaction Details
TargetMitogen-activated protein kinase 14
LigandBDBM50235911
Substrate/Competitorn/a
Meas. Tech.ChEMBL_462870 (CHEMBL928788)
IC50 7.1±n/a nM
Citation Liu, CLin, JPitt, SZhang, RFSack, JSKiefer, SEKish, KDoweyko, AMZhang, HMarathe, PHTrzaskos, JMckinnon, MDodd, JHBarrish, JCSchieven, GLLeftheris, K Benzothiazole based inhibitors of p38alpha MAP kinase. Bioorg Med Chem Lett18:1874-9 (2008) 
 
Mitogen-activated protein kinase 14
Name:Mitogen-activated protein kinase 14
Type:Serine/threonine-protein kinase
Mol. Mass.:41286.76
Organism:Homo sapiens (Human)
Description:Q16539
Residue:360
BDBM50235911
NameBDBM50235911
Synonyms:CHEMBL256925 | N-isopropyl-6-(4-phenyl-1H-imidazol-5-yl)benzo[d]thiazol-2-amine
TypeSmall organic molecule
Emp. Form.C19H18N4S
Mol. Mass.334.438
SMILESCC(C)Nc1nc2ccc(cc2s1)-c1nc[nH]c1-c1ccccc1