Reaction Details
TargetHistamine H3 receptor
LigandBDBM50237874
Substrate/Competitorn/a
Meas. Tech.ChEMBL_463102 (CHEMBL930008)
Ki 0.69±n/a nM
Citation Sasho, SSeishi, TKawamura, MHirose, RToki, SShimada, JI Diamine derivatives containing imidazolidinylidene propanedinitrile as a new class of histamine H3 receptor antagonists. Part I. Bioorg Med Chem Lett18:2288-91 (2008) 
 
Histamine H3 receptor
Name:Histamine H3 receptor
Type:G Protein-Coupled Receptor (GPCR)
Mol. Mass.:48607.98
Organism:Rattus norvegicus (rat)
Description:n/a
Residue:445
BDBM50237874
NameBDBM50237874
Synonyms:(+/-)-2-(1-(2-(2-methylpyrrolidin-1-yl)ethyl)-3-(2-(piperidin-1-yl)ethyl)imidazolidin-2-ylidene)malononitrile | CHEMBL257606
TypeSmall organic molecule
Emp. Form.C20H32N6
Mol. Mass.356.5083
SMILES[#6]-[#6]-1-[#6]-[#6]-[#6]-[#7]-1-[#6]-[#6]-[#7]1-[#6]-[#6]-[#7](-[#6]-[#6]-[#7]-2-[#6]-[#6]-[#6]-[#6]-[#6]-2)\[#6]-1=[#6](/C#N)C#N