Reaction Details
TargetDNA polymerase beta
LigandBDBM50242105
Substrate/Competitorn/a
Meas. Tech.ChEMBL_550598 (CHEMBL999199)
IC50 12300±n/a nM
Citation Prakash Chaturvedula, VSHecht, SMGao, ZJones, SHFeng, XKingston, DG New neolignans that inhibit DNA polymerase beta lyase. J Nat Prod67:964-7 (2004) 
 
DNA polymerase beta
Name:DNA polymerase beta
Type:Protein
Mol. Mass.:38188.76
Organism:Homo sapiens (Human)
Description:n/a
Residue:335
BDBM50242105
NameBDBM50242105
Synonyms:CHEMBL470873 | armenin-B
TypeSmall organic molecule
Emp. Form.C21H24O6
Mol. Mass.372.4117
SMILESCO[C@@H]1C[C@]2(CC=C)[C@H](C)[C@H](OC2=C(OC)C1=O)c1ccc2OCOc2c1