Reaction Details
TargetDelta-type opioid receptor
LigandBDBM50238620
Substrate/Competitorn/a
Meas. Tech.ChEMBL_525305 (CHEMBL968094)
Ki 1410±n/a nM
Citation Tidgewell, KHarding, WWLozama, ACobb, HShah, KKannan, PDersch, CMParrish, DDeschamps, JRRothman, RBPrisinzano, TE Synthesis of salvinorin A analogues as opioid receptor probes. J Nat Prod69:914-8 (2006) 
 
Delta-type opioid receptor
Name:Delta-type opioid receptor
Type:G Protein-Coupled Receptor (GPCR)
Mol. Mass.:40382.98
Organism:Homo sapiens (Human)
Description:Competition binding assays were carried out using membrane preparations from transfected HN9.10 cells that constitutively expressed the delta opioid receptor.
Residue:372
BDBM50238620
NameBDBM50238620
Synonyms:(2S,4aR,6aR,7R,9S,10aS,10bR)-9-(4-Bromobenzoyloxy)-2-(3-furanyl)-dodecahydro-6a,10b-dimethyl-4,10-dioxo-2H-naphtho-[2,1-c]pyran-7-carboxylic Acid Methyl Ester CHEMBL259299
TypeSmall organic molecule
Emp. Form.C28H29BrO8
Mol. Mass.573.429
SMILESCOC(=O)[C@@H]1C[C@H](OC(=O)c2ccc(Br)cc2)C(=O)[C@H]2[C@@]1(C)CC[C@H]1C(=O)O[C@@H](C[C@]21C)c1ccoc1