Reaction Details
TargetDelta-type opioid receptor
LigandBDBM50189138
Substrate/Competitorn/a
Meas. Tech.ChEMBL_525305 (CHEMBL968094)
Ki 4030±n/a nM
Citation Tidgewell, KHarding, WWLozama, ACobb, HShah, KKannan, PDersch, CMParrish, DDeschamps, JRRothman, RBPrisinzano, TE Synthesis of salvinorin A analogues as opioid receptor probes. J Nat Prod69:914-8 (2006) 
 
Delta-type opioid receptor
Name:Delta-type opioid receptor
Type:G Protein-Coupled Receptor (GPCR)
Mol. Mass.:40382.98
Organism:Homo sapiens (Human)
Description:Competition binding assays were carried out using membrane preparations from transfected HN9.10 cells that constitutively expressed the delta opioid receptor.
Residue:372
BDBM50189138
NameBDBM50189138
Synonyms:(2S,4aR,6aR,7R,9S,10aS,10bR)-methyl 9-(butyryloxy)-2-(furan-3-yl)-6a,10b-dimethyl-4,10-dioxo-dodecahydro-1H-benzo[f]isochromene-7-carboxylate CHEMBL379138
TypeSmall organic molecule
Emp. Form.C25H32O8
Mol. Mass.460.5168
SMILESCCCC(=O)O[C@H]1C[C@@H](C(=O)OC)[C@]2(C)CC[C@H]3C(=O)O[C@@H](C[C@]3(C)[C@H]2C1=O)c1ccoc1