Reaction Details
TargetKappa-type opioid receptor
LigandBDBM50269313
Substrate/Competitorn/a
Meas. Tech.ChEMBL_525306 (CHEMBL968095)
Ki 50±n/a nM
Citation Tidgewell, KHarding, WWLozama, ACobb, HShah, KKannan, PDersch, CMParrish, DDeschamps, JRRothman, RBPrisinzano, TE Synthesis of salvinorin A analogues as opioid receptor probes. J Nat Prod69:914-8 (2006) 
 
Kappa-type opioid receptor
Name:Kappa-type opioid receptor
Type:G Protein-Coupled Receptor (GPCR)
Mol. Mass.:42648.76
Organism:Homo sapiens (Human)
Description:P41145
Residue:380
BDBM50269313
NameBDBM50269313
Synonyms:(2S,4aS,6aR,7R,9S,10aS,10bR)-9-(4-Methylbenzenesulfonyloxy)-2-(3-furanyl)-dodecahydro-6a,10b-dimethyl-4,10-dioxo-2H-naphtho-[2,1-c]pyran-7-carboxylic Acid Methyl Ester | CHEMBL500122
TypeSmall organic molecule
Emp. Form.C28H32O9S
Mol. Mass.544.613
SMILESCOC(=O)[C@@H]1C[C@H](OS(=O)(=O)c2ccc(C)cc2)C(=O)[C@H]2[C@@]1(C)CC[C@H]1C(=O)O[C@@H](C[C@]21C)c1ccoc1