Reaction Details
TargetMu-type opioid receptor
LigandBDBM50269312
Substrate/Competitorn/a
Meas. Tech.ChEMBL_525304 (CHEMBL968093)
Ki>10000±n/a nM
Citation Tidgewell, KHarding, WWLozama, ACobb, HShah, KKannan, PDersch, CMParrish, DDeschamps, JRRothman, RBPrisinzano, TE Synthesis of salvinorin A analogues as opioid receptor probes. J Nat Prod69:914-8 (2006) 
 
Mu-type opioid receptor
Name:Mu-type opioid receptor
Type:G Protein-Coupled Receptor (GPCR)
Mol. Mass.:44789.51
Organism:Homo sapiens (Human)
Description:P35372
Residue:400
BDBM50269312
NameBDBM50269312
Synonyms:(2S,4aS,6aR,7R,9S,10aS,10bR)-9-(Benzenesulfonyloxy)-2-(3-furanyl)dodecahydro-6a,10b-dimethyl-4,10-dioxo-2H-naphtho[2,1-c]pyran-7-carboxylic Acid Methyl Ester | CHEMBL526700
TypeSmall organic molecule
Emp. Form.C27H30O9S
Mol. Mass.530.587
SMILESCOC(=O)[C@@H]1C[C@H](OS(=O)(=O)c2ccccc2)C(=O)[C@H]2[C@@]1(C)CC[C@H]1C(=O)O[C@@H](C[C@]21C)c1ccoc1