Reaction Details
TargetMu-type opioid receptor
LigandBDBM50238615
Substrate/Competitorn/a
Meas. Tech.ChEMBL_525304 (CHEMBL968093)
Ki 10±n/a nM
Citation Tidgewell, KHarding, WWLozama, ACobb, HShah, KKannan, PDersch, CMParrish, DDeschamps, JRRothman, RBPrisinzano, TE Synthesis of salvinorin A analogues as opioid receptor probes. J Nat Prod69:914-8 (2006) 
 
Mu-type opioid receptor
Name:Mu-type opioid receptor
Type:G Protein-Coupled Receptor (GPCR)
Mol. Mass.:44789.51
Organism:Homo sapiens (Human)
Description:P35372
Residue:400
BDBM50238615
NameBDBM50238615
Synonyms:CHEMBL264967 Thiophene-3-carboxylic Acid (2S,4aR,6aR,7R,9S,10aS,10bR)-7-Carbomethoxy-2-(3-furanyl)dodecahydro-6a,10b-dimethyl-4,10-dioxo-2H-naphtho[2,1-c]pyran-9-yl Ester
TypeSmall organic molecule
Emp. Form.C26H28O8S
Mol. Mass.500.561
SMILESCOC(=O)[C@@H]1C[C@H](OC(=O)c2cccs2)C(=O)[C@H]2[C@@]1(C)CC[C@H]1C(=O)O[C@@H](C[C@]21C)c1ccoc1