Reaction Details
TargetMu-type opioid receptor
LigandBDBM50269285
Substrate/Competitorn/a
Meas. Tech.ChEMBL_525304 (CHEMBL968093)
Ki 5660±n/a nM
Citation Tidgewell, KHarding, WWLozama, ACobb, HShah, KKannan, PDersch, CMParrish, DDeschamps, JRRothman, RBPrisinzano, TE Synthesis of salvinorin A analogues as opioid receptor probes. J Nat Prod69:914-8 (2006) 
 
Mu-type opioid receptor
Name:Mu-type opioid receptor
Type:G Protein-Coupled Receptor (GPCR)
Mol. Mass.:44789.51
Organism:Homo sapiens (Human)
Description:P35372
Residue:400
BDBM50269285
NameBDBM50269285
Synonyms:(2S,4aS,6aR,7R,9S,10aS,10bR)-9-(2-tert-Butoxycarbonylaminoacetyloxy)-2-(3-furanyl)dodecahydro-6a,10b-dimethyl-4,10-dioxo-2Hnaphtho[2,1-c]pyran-7-carboxylic Acid Methyl Ester | CHEMBL524522
TypeSmall organic molecule
Emp. Form.C28H37NO10
Mol. Mass.547.5941
SMILESCOC(=O)[C@@H]1C[C@H](OC(=O)CNC(=O)OC(C)(C)C)C(=O)[C@H]2[C@@]1(C)CC[C@H]1C(=O)O[C@@H](C[C@]21C)c1ccoc1