Reaction Details
TargetTyrosine-protein kinase Lyn
LigandBDBM482158
Substrate/Competitorn/a
Meas. Tech.ChEMBL_509002 (CHEMBL1006343)
IC50 1308±n/a nM
Citation Galkin, AVMelnick, JSKim, SHood, TLLi, NLi, LXia, GSteensma, RChopiuk, GJiang, JWan, YDing, PLiu, YSun, FSchultz, PGGray, NSWarmuth, M Identification of NVP-TAE684, a potent, selective, and efficacious inhibitor of NPM-ALK. Proc Natl Acad Sci U S A104:270-5 (2007) 
 
Tyrosine-protein kinase Lyn
Name:Tyrosine-protein kinase Lyn
Type:Protein
Mol. Mass.:58575.92
Organism:Homo sapiens (Human)
Description:P07948
Residue:512
BDBM482158
NameBDBM482158
Synonyms:BDBM50242742 | TAE684
Typen/a
Emp. Form.C30H40ClN7O3S
Mol. Mass.614.202
SMILESCOc1cc(ccc1Nc1ncc(Cl)c(Nc2ccccc2S(=O)(=O)C(C)C)n1)N1CCC(CC1)N1CCN(C)CC1