Reaction Details
TargetCannabinoid receptor 1
LigandBDBM50267375
Substrate/Competitorn/a
Meas. Tech.ChEMBL_564086 (CHEMBL963331)
Ki 13±n/a nM
Citation Fan, HKotsikorou, EHoffman, AFRavert, HTHolt, DHurst, DPLupica, CRReggio, PHDannals, RFHorti, AG Analogs of JHU75528, a PET ligand for imaging of cerebral cannabinoid receptors (CB1): development of ligands with optimized lipophilicity and binding affinity. Eur J Med Chem44:593-608 (2009) 
 
Cannabinoid receptor 1
Name:Cannabinoid receptor 1
Type:G Protein-Coupled Receptor (GPCR)
Mol. Mass.:52868.96
Organism:Homo sapiens (Human)
Description:P21554
Residue:472
BDBM50267375
NameBDBM50267375
Synonyms:1-(2-Chloro-4-fluorophenyl)-4-cyano-5-(4-methoxyphenyl)-N-(piperidin-1-yl)-1H-pyrazole-3-carboxamide | CHEMBL476232
TypeSmall organic molecule
Emp. Form.C23H21ClFN5O2
Mol. Mass.453.897
SMILESCOc1ccc(cc1)-c1c(C#N)c(nn1-c1ccc(F)cc1Cl)C(=O)NN1CCCCC1