Reaction Details
TargetCannabinoid receptor 2
LigandBDBM50244179
Substrate/Competitorn/a
Meas. Tech.ChEMBL_554819 (CHEMBL953972)
Ki 41±n/a nM
Citation Pagé, DBalaux, EBoisvert, LLiu, ZMilburn, CTremblay, MWei, ZWoo, SLuo, XCheng, YXYang, HSrivastava, SZhou, FBrown, WTomaszewski, MWalpole, CHodzic, LSt-Onge, SGodbout, CSalois, DPayza, KPayza, K Novel benzimidazole derivatives as selective CB2 agonists. Bioorg Med Chem Lett18:3695-700 (2008) 
 
Cannabinoid receptor 2
Name:Cannabinoid receptor 2
Type:G Protein-Coupled Receptor (GPCR)
Mol. Mass.:39690.94
Organism:Homo sapiens (Human)
Description:P34972
Residue:360
BDBM50244179
NameBDBM50244179
Synonyms:1-(2-(4-ethoxybenzyl)-1-(cyclopropylmethyl)-1H-benzo[d]imidazol-5-yl)-1,3,3-trimethylurea | CHEMBL462329
TypeSmall organic molecule
Emp. Form.C24H30N4O2
Mol. Mass.406.5206
SMILESCCOc1ccc(Cc2nc3cc(ccc3n2CC2CC2)N(C)C(=O)N(C)C)cc1