Reaction Details
TargetCannabinoid receptor 2
LigandBDBM50243859
Substrate/Competitorn/a
Meas. Tech.ChEMBL_554819 (CHEMBL953972)
Ki 75±n/a nM
Citation Pagé, DBalaux, EBoisvert, LLiu, ZMilburn, CTremblay, MWei, ZWoo, SLuo, XCheng, YXYang, HSrivastava, SZhou, FBrown, WTomaszewski, MWalpole, CHodzic, LSt-Onge, SGodbout, CSalois, DPayza, KPayza, K Novel benzimidazole derivatives as selective CB2 agonists. Bioorg Med Chem Lett18:3695-700 (2008) 
 
Cannabinoid receptor 2
Name:Cannabinoid receptor 2
Type:G Protein-Coupled Receptor (GPCR)
Mol. Mass.:39690.94
Organism:Homo sapiens (Human)
Description:P34972
Residue:360
BDBM50243859
NameBDBM50243859
Synonyms:(S)-2-(4-ethoxybenzyl)-N,N-diethyl-1-(piperidin-2-ylmethyl)-1H-benzo[d]imidazole-5-carboxamide | CHEMBL486440
TypeSmall organic molecule
Emp. Form.C27H36N4O2
Mol. Mass.448.6003
SMILESCCOc1ccc(Cc2nc3cc(ccc3n2C[C@@H]2CCCCN2)C(=O)N(CC)CC)cc1