Reaction Details
TargetCannabinoid receptor 2
LigandBDBM50244354
Substrate/Competitorn/a
Meas. Tech.ChEMBL_554819 (CHEMBL953972)
Ki 588±n/a nM
Citation Pagé, DBalaux, EBoisvert, LLiu, ZMilburn, CTremblay, MWei, ZWoo, SLuo, XCheng, YXYang, HSrivastava, SZhou, FBrown, WTomaszewski, MWalpole, CHodzic, LSt-Onge, SGodbout, CSalois, DPayza, KPayza, K Novel benzimidazole derivatives as selective CB2 agonists. Bioorg Med Chem Lett18:3695-700 (2008) 
 
Cannabinoid receptor 2
Name:Cannabinoid receptor 2
Type:G Protein-Coupled Receptor (GPCR)
Mol. Mass.:39690.94
Organism:Homo sapiens (Human)
Description:P34972
Residue:360
BDBM50244354
NameBDBM50244354
Synonyms:2-(4-ethoxy-benzyl)-1-(1-oxy-pyridin-4-ylmethyl)-1H-benzoimidazole-5-carboxylic acid diethylamide | CHEMBL471984
TypeSmall organic molecule
Emp. Form.C27H30N4O3
Mol. Mass.458.5521
SMILESCCOc1ccc(Cc2nc3cc(ccc3n2Cc2cc[n+]([O-])cc2)C(=O)N(CC)CC)cc1