Reaction Details
TargetCannabinoid receptor 2
LigandBDBM50244317
Substrate/Competitorn/a
Meas. Tech.ChEMBL_554819 (CHEMBL953972)
Ki 1±n/a nM
Citation Pagé, DBalaux, EBoisvert, LLiu, ZMilburn, CTremblay, MWei, ZWoo, SLuo, XCheng, YXYang, HSrivastava, SZhou, FBrown, WTomaszewski, MWalpole, CHodzic, LSt-Onge, SGodbout, CSalois, DPayza, KPayza, K Novel benzimidazole derivatives as selective CB2 agonists. Bioorg Med Chem Lett18:3695-700 (2008) 
 
Cannabinoid receptor 2
Name:Cannabinoid receptor 2
Type:G Protein-Coupled Receptor (GPCR)
Mol. Mass.:39690.94
Organism:Homo sapiens (Human)
Description:P34972
Residue:360
BDBM50244317
NameBDBM50244317
Synonyms:2-(4-ethoxybenzyl)-1-(cyclopentylmethyl)-N,N-diethyl-1H-benzo[d]imidazole-5-carboxamide | CHEMBL471129
TypeSmall organic molecule
Emp. Form.C27H35N3O2
Mol. Mass.433.5857
SMILESCCOc1ccc(Cc2nc3cc(ccc3n2CC2CCCC2)C(=O)N(CC)CC)cc1