Reaction Details
TargetCannabinoid receptor 1
LigandBDBM50244136
Substrate/Competitorn/a
Meas. Tech.ChEMBL_554820 (CHEMBL953973)
Ki>5000±n/a nM
Citation Pagé, DBalaux, EBoisvert, LLiu, ZMilburn, CTremblay, MWei, ZWoo, SLuo, XCheng, YXYang, HSrivastava, SZhou, FBrown, WTomaszewski, MWalpole, CHodzic, LSt-Onge, SGodbout, CSalois, DPayza, KPayza, K Novel benzimidazole derivatives as selective CB2 agonists. Bioorg Med Chem Lett18:3695-700 (2008) 
 
Cannabinoid receptor 1
Name:Cannabinoid receptor 1
Type:G Protein-Coupled Receptor (GPCR)
Mol. Mass.:52868.96
Organism:Homo sapiens (Human)
Description:P21554
Residue:472
BDBM50244136
NameBDBM50244136
Synonyms:1-(cyclopropylmethyl)-2-((6-ethoxypyridin-3-yl)methyl)-N,N-diethyl-1H-benzo[d]imidazole-5-carboxamide | CHEMBL461920
TypeSmall organic molecule
Emp. Form.C24H30N4O2
Mol. Mass.406.5206
SMILESCCOc1ccc(Cc2nc3cc(ccc3n2CC2CC2)C(=O)N(CC)CC)cn1