Reaction Details
TargetCannabinoid receptor 1
LigandBDBM50244008
Substrate/Competitorn/a
Meas. Tech.ChEMBL_554820 (CHEMBL953973)
Ki>5000±n/a nM
Citation Pagé, DBalaux, EBoisvert, LLiu, ZMilburn, CTremblay, MWei, ZWoo, SLuo, XCheng, YXYang, HSrivastava, SZhou, FBrown, WTomaszewski, MWalpole, CHodzic, LSt-Onge, SGodbout, CSalois, DPayza, KPayza, K Novel benzimidazole derivatives as selective CB2 agonists. Bioorg Med Chem Lett18:3695-700 (2008) 
 
Cannabinoid receptor 1
Name:Cannabinoid receptor 1
Type:G Protein-Coupled Receptor (GPCR)
Mol. Mass.:52868.96
Organism:Homo sapiens (Human)
Description:P21554
Residue:472
BDBM50244008
NameBDBM50244008
Synonyms:2-(4-(2,2,2-trifluoroethoxy)benzyl)-N,N-diethyl-1-isopentyl-1H-benzo[d]imidazole-5-carboxamide | CHEMBL452039
TypeSmall organic molecule
Emp. Form.C26H32F3N3O2
Mol. Mass.475.5464
SMILESCCN(CC)C(=O)c1ccc2n(CCC(C)C)c(Cc3ccc(OCC(F)(F)F)cc3)nc2c1