Reaction Details
TargetCannabinoid receptor 1
LigandBDBM50243964
Substrate/Competitorn/a
Meas. Tech.ChEMBL_554820 (CHEMBL953973)
Ki>5000±n/a nM
Citation Pagé, DBalaux, EBoisvert, LLiu, ZMilburn, CTremblay, MWei, ZWoo, SLuo, XCheng, YXYang, HSrivastava, SZhou, FBrown, WTomaszewski, MWalpole, CHodzic, LSt-Onge, SGodbout, CSalois, DPayza, KPayza, K Novel benzimidazole derivatives as selective CB2 agonists. Bioorg Med Chem Lett18:3695-700 (2008) 
 
Cannabinoid receptor 1
Name:Cannabinoid receptor 1
Type:G Protein-Coupled Receptor (GPCR)
Mol. Mass.:52868.96
Organism:Homo sapiens (Human)
Description:P21554
Residue:472
BDBM50243964
NameBDBM50243964
Synonyms:2-(4-(cyclohexyloxy)benzyl)-N,N-diethyl-1-isopentyl-1H-benzo[d]imidazole-5-carboxamide | CHEMBL452804
TypeSmall organic molecule
Emp. Form.C30H41N3O2
Mol. Mass.475.6654
SMILESCCN(CC)C(=O)c1ccc2n(CCC(C)C)c(Cc3ccc(OC4CCCCC4)cc3)nc2c1