Reaction Details
TargetCannabinoid receptor 1
LigandBDBM50243708
Substrate/Competitorn/a
Meas. Tech.ChEMBL_554820 (CHEMBL953973)
Ki>5000±n/a nM
Citation Pagé, DBalaux, EBoisvert, LLiu, ZMilburn, CTremblay, MWei, ZWoo, SLuo, XCheng, YXYang, HSrivastava, SZhou, FBrown, WTomaszewski, MWalpole, CHodzic, LSt-Onge, SGodbout, CSalois, DPayza, KPayza, K Novel benzimidazole derivatives as selective CB2 agonists. Bioorg Med Chem Lett18:3695-700 (2008) 
 
Cannabinoid receptor 1
Name:Cannabinoid receptor 1
Type:G Protein-Coupled Receptor (GPCR)
Mol. Mass.:52868.96
Organism:Homo sapiens (Human)
Description:P21554
Residue:472
BDBM50243708
NameBDBM50243708
Synonyms:(R)-2-(4-ethoxybenzyl)-N,N-diethyl-1-((tetrahydrofuran-2-yl)methyl)-1H-benzo[d]imidazole-5-carboxamide | CHEMBL512886
TypeSmall organic molecule
Emp. Form.C26H33N3O3
Mol. Mass.435.5585
SMILESCCOc1ccc(Cc2nc3cc(ccc3n2C[C@H]2CCCO2)C(=O)N(CC)CC)cc1