Reaction Details
TargetCannabinoid receptor 1
LigandBDBM50244178
Substrate/Competitorn/a
Meas. Tech.ChEMBL_554820 (CHEMBL953973)
Ki 2483±n/a nM
Citation Pagé, DBalaux, EBoisvert, LLiu, ZMilburn, CTremblay, MWei, ZWoo, SLuo, XCheng, YXYang, HSrivastava, SZhou, FBrown, WTomaszewski, MWalpole, CHodzic, LSt-Onge, SGodbout, CSalois, DPayza, KPayza, K Novel benzimidazole derivatives as selective CB2 agonists. Bioorg Med Chem Lett18:3695-700 (2008) 
 
Cannabinoid receptor 1
Name:Cannabinoid receptor 1
Type:G Protein-Coupled Receptor (GPCR)
Mol. Mass.:52868.96
Organism:Homo sapiens (Human)
Description:P21554
Residue:472
BDBM50244178
NameBDBM50244178
Synonyms:CHEMBL518206 | N-(2-(4-ethoxybenzyl)-1-(cyclopropylmethyl)-1H-benzo[d]imidazol-5-yl)-N-methylthiophene-2-carboxamide
TypeSmall organic molecule
Emp. Form.C26H27N3O2S
Mol. Mass.445.576
SMILESCCOc1ccc(Cc2nc3cc(ccc3n2CC2CC2)N(C)C(=O)c2cccs2)cc1