Reaction Details
TargetCannabinoid receptor 1
LigandBDBM50244319
Substrate/Competitorn/a
Meas. Tech.ChEMBL_554820 (CHEMBL953973)
Ki 406±n/a nM
Citation Pagé, DBalaux, EBoisvert, LLiu, ZMilburn, CTremblay, MWei, ZWoo, SLuo, XCheng, YXYang, HSrivastava, SZhou, FBrown, WTomaszewski, MWalpole, CHodzic, LSt-Onge, SGodbout, CSalois, DPayza, KPayza, K Novel benzimidazole derivatives as selective CB2 agonists. Bioorg Med Chem Lett18:3695-700 (2008) 
 
Cannabinoid receptor 1
Name:Cannabinoid receptor 1
Type:G Protein-Coupled Receptor (GPCR)
Mol. Mass.:52868.96
Organism:Homo sapiens (Human)
Description:P21554
Residue:472
BDBM50244319
NameBDBM50244319
Synonyms:1-adamantan-1-ylmethyl-2-(4-ethoxy-benzyl)-1H-benzoimidazole-5-carboxylic acid diethylamide | CHEMBL511134
TypeSmall organic molecule
Emp. Form.C32H41N3O2
Mol. Mass.499.6868
SMILESCCOc1ccc(Cc2nc3cc(ccc3n2CC23CC4CC(CC(C4)C2)C3)C(=O)N(CC)CC)cc1