Reaction Details
TargetCannabinoid receptor 1
LigandBDBM50244318
Substrate/Competitorn/a
Meas. Tech.ChEMBL_554820 (CHEMBL953973)
Ki 110±n/a nM
Citation Pagé, DBalaux, EBoisvert, LLiu, ZMilburn, CTremblay, MWei, ZWoo, SLuo, XCheng, YXYang, HSrivastava, SZhou, FBrown, WTomaszewski, MWalpole, CHodzic, LSt-Onge, SGodbout, CSalois, DPayza, KPayza, K Novel benzimidazole derivatives as selective CB2 agonists. Bioorg Med Chem Lett18:3695-700 (2008) 
 
Cannabinoid receptor 1
Name:Cannabinoid receptor 1
Type:G Protein-Coupled Receptor (GPCR)
Mol. Mass.:52868.96
Organism:Homo sapiens (Human)
Description:P21554
Residue:472
BDBM50244318
NameBDBM50244318
Synonyms:2-(4-ethoxybenzyl)-1-(cyclohexylmethyl)-N,N-diethyl-1H-benzo[d]imidazole-5-carboxamide | CHEMBL470965
TypeSmall organic molecule
Emp. Form.C28H37N3O2
Mol. Mass.447.6123
SMILESCCOc1ccc(Cc2nc3cc(ccc3n2CC2CCCCC2)C(=O)N(CC)CC)cc1