Reaction Details
TargetCannabinoid receptor 2
LigandBDBM50244010
Substrate/Competitorn/a
Meas. Tech.ChEMBL_554821 (CHEMBL953974)
EC50 3.2±n/a nM
Citation Pagé, DBalaux, EBoisvert, LLiu, ZMilburn, CTremblay, MWei, ZWoo, SLuo, XCheng, YXYang, HSrivastava, SZhou, FBrown, WTomaszewski, MWalpole, CHodzic, LSt-Onge, SGodbout, CSalois, DPayza, KPayza, K Novel benzimidazole derivatives as selective CB2 agonists. Bioorg Med Chem Lett18:3695-700 (2008) 
 
Cannabinoid receptor 2
Name:Cannabinoid receptor 2
Type:G Protein-Coupled Receptor (GPCR)
Mol. Mass.:39690.94
Organism:Homo sapiens (Human)
Description:P34972
Residue:360
BDBM50244010
NameBDBM50244010
Synonyms:2-(4-phenoxybenzyl)-N,N-diethyl-1-isopentyl-1H-benzo[d]imidazole-5-carboxamide | CHEMBL510072
TypeSmall organic molecule
Emp. Form.C30H35N3O2
Mol. Mass.469.6178
SMILESCCN(CC)C(=O)c1ccc2n(CCC(C)C)c(Cc3ccc(Oc4ccccc4)cc3)nc2c1