Reaction Details
TargetCannabinoid receptor 2
LigandBDBM50243861
Substrate/Competitorn/a
Meas. Tech.ChEMBL_554821 (CHEMBL953974)
EC50 2.3±n/a nM
Citation Pagé, DBalaux, EBoisvert, LLiu, ZMilburn, CTremblay, MWei, ZWoo, SLuo, XCheng, YXYang, HSrivastava, SZhou, FBrown, WTomaszewski, MWalpole, CHodzic, LSt-Onge, SGodbout, CSalois, DPayza, KPayza, K Novel benzimidazole derivatives as selective CB2 agonists. Bioorg Med Chem Lett18:3695-700 (2008) 
 
Cannabinoid receptor 2
Name:Cannabinoid receptor 2
Type:G Protein-Coupled Receptor (GPCR)
Mol. Mass.:39690.94
Organism:Homo sapiens (Human)
Description:P34972
Residue:360
BDBM50243861
NameBDBM50243861
Synonyms:(R)-2-(4-ethoxybenzyl)-N,N-diethyl-1-((1-methylpiperidin-2-yl)methyl)-1H-benzo[d]imidazole-5-carboxamide | CHEMBL488310
TypeSmall organic molecule
Emp. Form.C28H38N4O2
Mol. Mass.462.6269
SMILESCCOc1ccc(Cc2nc3cc(ccc3n2C[C@H]2CCCCN2C)C(=O)N(CC)CC)cc1