Reaction Details
TargetCannabinoid receptor 2
LigandBDBM50244276
Substrate/Competitorn/a
Meas. Tech.ChEMBL_554819 (CHEMBL953972)
Ki 4.5±n/a nM
Citation Pagé, DBalaux, EBoisvert, LLiu, ZMilburn, CTremblay, MWei, ZWoo, SLuo, XCheng, YXYang, HSrivastava, SZhou, FBrown, WTomaszewski, MWalpole, CHodzic, LSt-Onge, SGodbout, CSalois, DPayza, KPayza, K Novel benzimidazole derivatives as selective CB2 agonists. Bioorg Med Chem Lett18:3695-700 (2008) 
 
Cannabinoid receptor 2
Name:Cannabinoid receptor 2
Type:G Protein-Coupled Receptor (GPCR)
Mol. Mass.:39690.94
Organism:Homo sapiens (Human)
Description:P34972
Residue:360
BDBM50244276
NameBDBM50244276
Synonyms:2-(4-ethoxybenzyl)-N,N-diethyl-1-isopentyl-1H-benzo[d]imidazole-5-carboxamide | CHEMBL471980
TypeSmall organic molecule
Emp. Form.C26H35N3O2
Mol. Mass.421.575
SMILESCCOc1ccc(Cc2nc3cc(ccc3n2CCC(C)C)C(=O)N(CC)CC)cc1