Reaction Details
TargetCannabinoid receptor 1
LigandBDBM21281
Substrate/Competitorn/a
Meas. Tech.ChEMBL_554820 (CHEMBL953973)
Ki 140±n/a nM
Citation Pagé, DBalaux, EBoisvert, LLiu, ZMilburn, CTremblay, MWei, ZWoo, SLuo, XCheng, YXYang, HSrivastava, SZhou, FBrown, WTomaszewski, MWalpole, CHodzic, LSt-Onge, SGodbout, CSalois, DPayza, KPayza, K Novel benzimidazole derivatives as selective CB2 agonists. Bioorg Med Chem Lett18:3695-700 (2008) 
 
Cannabinoid receptor 1
Name:Cannabinoid receptor 1
Type:G Protein-Coupled Receptor (GPCR)
Mol. Mass.:52868.96
Organism:Homo sapiens (Human)
Description:P21554
Residue:472
BDBM21281
NameBDBM21281
Synonyms:(11R)-2-methyl-11-(morpholin-4-ylmethyl)-3-(naphthalen-1-ylcarbonyl)-9-oxa-1-azatricyclo[6.3.1.0^{4,12}]dodeca-2,4(12),5,7-tetraene CHEMBL188 WIN 55212-2 WIN55212-2
TypeAnalgesic
Emp. Form.C27H26N2O3
Mol. Mass.426.5069
SMILESCc1c(C(=O)c2cccc3ccccc23)c2cccc3OC[C@@H](CN4CCOCC4)n1c23