Reaction Details
TargetGlucagon receptor
LigandBDBM50244238
Substrate/Competitorn/a
Meas. Tech.ChEMBL_491827 (CHEMBL945217)
IC50 7±n/a nM
Citation Kim, RMChang, JLins, ARBrady, ECandelore, MRDallas-Yang, QDing, VDragovic, JIliff, SJiang, GMock, SQureshi, SSaperstein, RSzalkowski, DTamvakopoulos, CTota, LWright, MYang, XTata, JRChapman, KZhang, BBParmee, ER Discovery of potent, orally active benzimidazole glucagon receptor antagonists. Bioorg Med Chem Lett18:3701-5 (2008) 
 
Glucagon receptor
Name:Glucagon receptor
Type:Enzyme
Mol. Mass.:54026.92
Organism:Homo sapiens (Human)
Description:P47871
Residue:477
BDBM50244238
NameBDBM50244238
Synonyms:CHEMBL499372 | trans-4-(((5-(benzyloxy)-1-methyl-1H-benzo[d]imidazol-2-yl)(4-tert-butylcyclohexyl)amino)methyl)-N-(1H-tetrazol-5-yl)benzamide
TypeSmall organic molecule
Emp. Form.C34H40N8O2
Mol. Mass.592.7338
SMILESCn1c(nc2cc(OCc3ccccc3)ccc12)N(Cc1ccc(cc1)C(=O)Nc1nnn[nH]1)[C@H]1CC[C@@H](CC1)C(C)(C)C