Reaction Details
TargetGlucagon receptor
LigandBDBM50244235
Substrate/Competitorn/a
Meas. Tech.ChEMBL_491827 (CHEMBL945217)
IC50 4±n/a nM
Citation Kim, RMChang, JLins, ARBrady, ECandelore, MRDallas-Yang, QDing, VDragovic, JIliff, SJiang, GMock, SQureshi, SSaperstein, RSzalkowski, DTamvakopoulos, CTota, LWright, MYang, XTata, JRChapman, KZhang, BBParmee, ER Discovery of potent, orally active benzimidazole glucagon receptor antagonists. Bioorg Med Chem Lett18:3701-5 (2008) 
 
Glucagon receptor
Name:Glucagon receptor
Type:Enzyme
Mol. Mass.:54026.92
Organism:Homo sapiens (Human)
Description:P47871
Residue:477
BDBM50244235
NameBDBM50244235
Synonyms:CHEMBL480692 | trans-4-(((4-tert-butylcyclohexyl)(1-methyl-5-propoxy-1H-benzo[d]imidazol-2-yl)amino)methyl)-N-(1H-tetrazol-5-yl)benzamide
TypeSmall organic molecule
Emp. Form.C30H40N8O2
Mol. Mass.544.691
SMILESCCCOc1ccc2n(C)c(nc2c1)N(Cc1ccc(cc1)C(=O)Nc1nnn[nH]1)[C@H]1CC[C@@H](CC1)C(C)(C)C