Reaction Details
TargetGastric inhibitory polypeptide
LigandBDBM50244337
Substrate/Competitorn/a
Meas. Tech.ChEMBL_491828 (CHEMBL945218)
IC50 3000±n/a nM
Citation Kim, RMChang, JLins, ARBrady, ECandelore, MRDallas-Yang, QDing, VDragovic, JIliff, SJiang, GMock, SQureshi, SSaperstein, RSzalkowski, DTamvakopoulos, CTota, LWright, MYang, XTata, JRChapman, KZhang, BBParmee, ER Discovery of potent, orally active benzimidazole glucagon receptor antagonists. Bioorg Med Chem Lett18:3701-5 (2008) 
 
Gastric inhibitory polypeptide
Name:Gastric inhibitory polypeptide
Type:PROTEIN
Mol. Mass.:17110.38
Organism:Homo sapiens (Human)
Description:ChEMBL_491828
Residue:153
BDBM50244337
NameBDBM50244337
Synonyms:CHEMBL511964 | trans-4-(((4-tert-butylcyclohexyl)(5,6-dichloro-1-methyl-1H-benzo[d]imidazol-2-yl)amino)methyl)-N-(1H-tetrazol-5-yl)benzamide
TypeSmall organic molecule
Emp. Form.C27H32Cl2N8O
Mol. Mass.555.502
SMILESCn1c(nc2cc(Cl)c(Cl)cc12)N(Cc1ccc(cc1)C(=O)Nc1nnn[nH]1)[C@H]1CC[C@@H](CC1)C(C)(C)C