Reaction Details
TargetHistamine H3 receptor
LigandBDBM50243122
Substrate/Competitorn/a
Meas. Tech.ChEMBL_491618 (CHEMBL945389)
Ki 0.4±n/a nM
Citation Santora, VJCovel, JAHayashi, RHofilena, BJIbarra, JBPulley, MDWeinhouse, MISemple, GRen, APereira, GEdwards, JESuarez, MFrazer, JThomsen, WHauser, ELorea, JGrottick, AJ Novel H3 receptor antagonists with improved pharmacokinetic profiles. Bioorg Med Chem Lett18:4133-6 (2008) 
 
Histamine H3 receptor
Name:Histamine H3 receptor
Type:G Protein-Coupled Receptor (GPCR)
Mol. Mass.:48607.98
Organism:Rattus norvegicus (rat)
Description:n/a
Residue:445
BDBM50243122
NameBDBM50243122
Synonyms:2-methyl-1-((3aR,6aR)-6-(4-(2-((R)-2-methylpyrrolidin-1-yl)ethyl)phenyl)-1,3a,4,6a-tetrahydrocyclopenta[c]pyrrol-2(1H)-yl)propan-1-one | CHEMBL488463
TypeSmall organic molecule
Emp. Form.C24H34N2O
Mol. Mass.366.5396
SMILESCC(C)C(=O)N1C[C@@H]2CC=C([C@@H]2C1)c1ccc(CCN2CCC[C@H]2C)cc1